Target
Bombesin receptor subtype-3
Ligand
BDBM50127518
Substrate
Meas. Tech.
ChEMBL_39239 (CHEMBL655889)
EC50
0.19±n/a nM
Citation
 Weber, DBerger, CEickelmann, PAntel, JKessler, H Design of selective peptidomimetic agonists for the human orphan receptor BRS-3. J Med Chem 46:1918-30 (2003)  
Target
Name:
Bombesin receptor subtype-3
Synonyms:
BRS-3 BRS3_HUMAN Bombesin like receptor 3
Type:
Enzyme Catalytic Domain
Mol. Mass.:
44424.45
Organism:
Homo sapiens (Human)
Description:
Bombesin 3 BRS3 HUMAN::P32247
Residue:
399
  
Inhibitor
Name:
BDBM50127518
Synonyms:
CHEMBL57104 | peptidomimetic
Type:
Small organic molecule
Emp. Form.:
C28H28ClN5O3
Mol. Mass.:
518.007
SMILES:
Clc1ccc(CC(=O)NNC(=O)NC(Cc2c[nH]c3ccccc23)C(=O)NCCc2ccccc2)cc1
: