Target
Bombesin receptor subtype-3
Ligand
BDBM50127527
Substrate
Meas. Tech.
ChEMBL_39239 (CHEMBL655889)
EC50
2.2±n/a nM
Citation
 Weber, DBerger, CEickelmann, PAntel, JKessler, H Design of selective peptidomimetic agonists for the human orphan receptor BRS-3. J Med Chem 46:1918-30 (2003)  
Target
Name:
Bombesin receptor subtype-3
Synonyms:
BRS-3 BRS3_HUMAN Bombesin like receptor 3
Type:
Enzyme Catalytic Domain
Mol. Mass.:
44424.45
Organism:
Homo sapiens (Human)
Description:
Bombesin 3 BRS3 HUMAN::P32247
Residue:
399
  
Inhibitor
Name:
BDBM50127527
Synonyms:
CHEMBL294647 | peptidomimetic
Type:
Small organic molecule
Emp. Form.:
C30H30N6O3
Mol. Mass.:
522.5976
SMILES:
O=C(Cc1cc2ccccc2[nH]1)NNC(=O)NC(Cc1c[nH]c2ccccc12)C(=O)NCCc1ccccc1
: