Target
Bombesin receptor subtype-3
Ligand
BDBM50127530
Substrate
Meas. Tech.
ChEMBL_39239 (CHEMBL655889)
EC50
7.8±n/a nM
Citation
 Weber, DBerger, CEickelmann, PAntel, JKessler, H Design of selective peptidomimetic agonists for the human orphan receptor BRS-3. J Med Chem 46:1918-30 (2003)  
Target
Name:
Bombesin receptor subtype-3
Synonyms:
BRS-3 BRS3_HUMAN Bombesin like receptor 3
Type:
Enzyme Catalytic Domain
Mol. Mass.:
44424.45
Organism:
Homo sapiens (Human)
Description:
Bombesin 3 BRS3 HUMAN::P32247
Residue:
399
  
Inhibitor
Name:
BDBM50127530
Synonyms:
2-[2-(2-Benzo[1,3]dioxol-5-yl-acetylamino)-propionylamino]-3-(1H-indol-3-yl)-N-phenethyl-propionamide | CHEMBL56159
Type:
Small organic molecule
Emp. Form.:
C31H32N4O5
Mol. Mass.:
540.6096
SMILES:
CC(NC(=O)Cc1ccc2OCOc2c1)C(=O)NC(Cc1c[nH]c2ccccc12)C(=O)NCCc1ccccc1
: