Target
ATP-sensitive inward rectifier potassium channel 11
Ligand
BDBM50127801
Substrate
Meas. Tech.
ChEBML_92724
EC50
15±n/a nM
Citation
 Turner, SCCarroll, WAWhite, TKBrune, MEBuckner, SAGopalakrishnan, MFabiyi, ACoghlan, MJScott, VECastle, NADaza, AVMilicic, ISullivan, JP Structure-activity relationship of a novel class of naphthyl amide KATP channel openers. Bioorg Med Chem Lett 13:1741-4 (2003)  
Target
Name:
ATP-sensitive inward rectifier potassium channel 11
Synonyms:
ATP-sensitive inward rectifier potassium channel 11 Inward rectifier K(+) channel Kir6.2 KCNJ11 Potassium channel, inwardly rectifying, subfamily J, member 11 Sulfonylurea receptor 2, Kir6.2
Type:
Enzyme Catalytic Domain
Mol. Mass.:
43549.41
Organism:
Homo sapiens (Human)
Description:
Potassium channel (ATP modulatory) 0 0::Q14654
Residue:
390
  
Inhibitor
Name:
BDBM50127801
Synonyms:
CHEMBL50760 | N-[2-(2,2,2-Trifluoro-1-hydroxy-1-trifluoromethyl-ethyl)-naphthalen-1-yl]-propionamide
Type:
Small organic molecule
Emp. Form.:
C16H13F6NO2
Mol. Mass.:
365.2703
SMILES:
CCC(=O)Nc1c(ccc2ccccc12)C(O)(C(F)(F)F)C(F)(F)F
: