Target
ATP-sensitive inward rectifier potassium channel 11
Ligand
BDBM50127804
Substrate
Meas. Tech.
ChEBML_92724
EC50
2220±n/a nM
Citation
 Turner, SCCarroll, WAWhite, TKBrune, MEBuckner, SAGopalakrishnan, MFabiyi, ACoghlan, MJScott, VECastle, NADaza, AVMilicic, ISullivan, JP Structure-activity relationship of a novel class of naphthyl amide KATP channel openers. Bioorg Med Chem Lett 13:1741-4 (2003)  
Target
Name:
ATP-sensitive inward rectifier potassium channel 11
Synonyms:
ATP-sensitive inward rectifier potassium channel 11 Inward rectifier K(+) channel Kir6.2 KCNJ11 Potassium channel, inwardly rectifying, subfamily J, member 11 Sulfonylurea receptor 2, Kir6.2
Type:
Enzyme Catalytic Domain
Mol. Mass.:
43549.41
Organism:
Homo sapiens (Human)
Description:
Potassium channel (ATP modulatory) 0 0::Q14654
Residue:
390
  
Inhibitor
Name:
BDBM50127804
Synonyms:
CHEMBL49321 | N-[6-Hydroxy-2-(2,2,2-trifluoro-1-hydroxy-1-trifluoromethyl-ethyl)-naphthalen-1-yl]-acetamide
Type:
Small organic molecule
Emp. Form.:
C15H11F6NO3
Mol. Mass.:
367.2432
SMILES:
CC(=O)Nc1c(ccc2cc(O)ccc12)C(O)(C(F)(F)F)C(F)(F)F
: