Target
Muscarinic acetylcholine receptor M1
Ligand
BDBM50128241
Substrate
Meas. Tech.
ChEMBL_138406 (CHEMBL744768)
Ki
250±n/a nM
Citation
 Kim, MGBodor, ETWang, CHarden, TKKohn, H C(8) substituted 1-azabicyclo[3.3.1]non-3-enes and C(8) substituted 1-azabicyclo[3.3.1]nonan-4-ones: novel muscarinic receptor antagonists. J Med Chem 46:2216-26 (2003)  
Target
Name:
Muscarinic acetylcholine receptor M1
Synonyms:
ACM1_HUMAN Cholinergic receptor, muscarinic 1 | Cholinergic, muscarinic M1
Type:
Protein
Mol. Mass.:
51442.54
Organism:
Homo sapiens (Human)
Description:
P11229
Residue:
460
  
Inhibitor
Name:
BDBM50128241
Synonyms:
CHEMBL69452 exo-8-Benzyloxymethyl-4-hydroxy-1-aza-bicyclo[3.3.1]non-3-ene-3-carboxylic acid ethyl ester
Type:
Small organic molecule
Emp. Form.:
C19H25NO4
Mol. Mass.:
331.4061
SMILES:
CCOC(=O)C1CN2CC(CCC2COCc2ccccc2)C1=O
: