Target
Muscarinic acetylcholine receptor M3
Ligand
BDBM50128242
Substrate
Meas. Tech.
ChEMBL_138704 (CHEMBL747819)
Ki
1500±n/a nM
Citation
 Kim, MGBodor, ETWang, CHarden, TKKohn, H C(8) substituted 1-azabicyclo[3.3.1]non-3-enes and C(8) substituted 1-azabicyclo[3.3.1]nonan-4-ones: novel muscarinic receptor antagonists. J Med Chem 46:2216-26 (2003)  
Target
Name:
Muscarinic acetylcholine receptor M3
Synonyms:
ACM3_HUMAN Cholinergic, muscarinic M3 Muscarinic receptor M3 | RecName: Full=Muscarinic acetylcholine receptor M3
Type:
Enzyme
Mol. Mass.:
66151.03
Organism:
Homo sapiens (Human)
Description:
P20309
Residue:
590
  
Inhibitor
Name:
BDBM50128242
Synonyms:
4-Hydroxy-1-aza-bicyclo[3.3.1]non-3-ene-3-carboxylic acid ethyl ester | CHEMBL306462
Type:
Small organic molecule
Emp. Form.:
C11H17NO3
Mol. Mass.:
211.2576
SMILES:
CCOC(=O)C1CN2CCCC(C2)C1=O
: