Target
Glutamate receptor 3
Ligand
BDBM50128264
Substrate
Meas. Tech.
ChEMBL_90296 (CHEMBL698776)
Ki
27500±n/a nM
Citation
 Bjerrum, EJKristensen, ASPickering, DSGreenwood, JRNielsen, BLiljefors, TSchousboe, ABräuner-Osborne, HMadsen, U Design, synthesis, and pharmacology of a highly subtype-selective GluR1/2 agonist, (RS)-2-amino-3-(4-chloro-3-hydroxy-5-isoxazolyl)propionic acid (Cl-HIBO). J Med Chem 46:2246-9 (2003)  
Target
Name:
Glutamate receptor 3
Synonyms:
AMPA-selective glutamate receptor 3 GLURC GRIA3_HUMAN GluR-C Glutamate receptor 3 Glutamate receptor ionotropic, AMPA 3
Type:
PROTEIN
Mol. Mass.:
101172.14
Organism:
Homo sapiens (Human)
Description:
ChEMBL_468627
Residue:
894
  
Inhibitor
Name:
BDBM50128264
Synonyms:
(R,S)-2-amino-3-(4-chloro-3-hydroxy-5-isoxazolyl)propionate CHEMBL72366
Type:
Small organic molecule
Emp. Form.:
C6H7ClN2O4
Mol. Mass.:
206.584
SMILES:
NC(Cc1o[nH]c(=O)c1Cl)C(O)=O
: