Target
Glutamate receptor 2
Ligand
BDBM50128264
Substrate
Meas. Tech.
ChEMBL_90155 (CHEMBL696977)
EC50
1700±n/a nM
Citation
 Bjerrum, EJKristensen, ASPickering, DSGreenwood, JRNielsen, BLiljefors, TSchousboe, ABräuner-Osborne, HMadsen, U Design, synthesis, and pharmacology of a highly subtype-selective GluR1/2 agonist, (RS)-2-amino-3-(4-chloro-3-hydroxy-5-isoxazolyl)propionic acid (Cl-HIBO). J Med Chem 46:2246-9 (2003)  
Target
Name:
Glutamate receptor 2
Synonyms:
GRIA2_RAT Glutamate receptor AMPA 2/4 Gria2
Type:
PROTEIN
Mol. Mass.:
98691.74
Organism:
Rattus norvegicus
Description:
ChEMBL_936441
Residue:
883
  
Inhibitor
Name:
BDBM50128264
Synonyms:
(R,S)-2-amino-3-(4-chloro-3-hydroxy-5-isoxazolyl)propionate CHEMBL72366
Type:
Small organic molecule
Emp. Form.:
C6H7ClN2O4
Mol. Mass.:
206.584
SMILES:
NC(Cc1o[nH]c(=O)c1Cl)C(O)=O
: