Target
Estrogen receptor
Ligand
BDBM20608
Substrate
Meas. Tech.
ChEBML_67514
Ki
0.500000±n/a nM
Citation
 Wallace, OBLauwers, KSJones, SADodge, JA Tetrahydroquinoline-based selective estrogen receptor modulators (SERMs). Bioorg Med Chem Lett 13:1907-10 (2003)  
Target
Name:
Estrogen receptor
Synonyms:
ER ESR ESR1_HUMAN Estrogen receptor Estrogen receptor (ER-alpha) Estrogen receptor alpha (ER) Nuclear receptor subfamily 3 group A member 1
Type:
Protein
Mol. Mass.:
66230.44
Organism:
Homo sapiens (Human)
Description:
P03372
Residue:
595
  
Inhibitor
Name:
BDBM20608
Synonyms:
4-Hydroxytamoxifen 4-[(1Z)-1-{4-[2-(dimethylamino)ethoxy]phenyl}-2-phenylbut-1-en-1-yl]phenol CHEMBL489 cid_449459
Type:
Small organic molecule
Emp. Form.:
C26H29NO2
Mol. Mass.:
387.514
SMILES:
CC\C(=C(/c1ccc(O)cc1)c1ccc(OCCN(C)C)cc1)c1ccccc1
: