Target
Estrogen receptor beta
Ligand
BDBM50128400
Substrate
Meas. Tech.
ChEMBL_99795 (CHEMBL874174)
IC50
490±n/a nM
Citation
 Wallace, OBLauwers, KSJones, SADodge, JA Tetrahydroquinoline-based selective estrogen receptor modulators (SERMs). Bioorg Med Chem Lett 13:1907-10 (2003)  
Target
Name:
Estrogen receptor beta
Synonyms:
Estrogen receptor
Type:
Mol. Mass.:
Description:
ASSAY_ID of ChEMBL is 99778
Components:
This complex has 2 components.
Component 1
Name:
Estrogen receptor beta
Synonyms:
ER-beta ESR2_HUMAN Estradiol receptor beta (ERβ) Estrogen receptor (ER beta) Estrogen receptor beta (ER beta) NR3A2 estrogen beta
Type:
Protein
Mol. Mass.:
59238.43
Organism:
Homo sapiens (Human)
Description:
Q92731
Residue:
530
  
Component 2
Name:
Estrogen receptor
Synonyms:
ER ESR ESR1_HUMAN Estrogen receptor Estrogen receptor (ER-alpha) Estrogen receptor alpha (ER) Nuclear receptor subfamily 3 group A member 1
Type:
Protein
Mol. Mass.:
66230.44
Organism:
Homo sapiens (Human)
Description:
P03372
Residue:
595
  
Inhibitor
Name:
BDBM50128400
Synonyms:
2-Phenyl-1-[4-(2-piperidin-1-yl-ethoxy)-benzyl]-1,2,3,4-tetrahydro-quinolin-6-ol | CHEMBL60538
Type:
Small organic molecule
Emp. Form.:
C29H34N2O2
Mol. Mass.:
442.5925
SMILES:
Oc1ccc2N(Cc3ccc(OCCN4CCCCC4)cc3)C(CCc2c1)c1ccccc1
: