Target
Estrogen receptor beta
Ligand
BDBM50128393
Substrate
Meas. Tech.
ChEMBL_99795 (CHEMBL874174)
IC50
590±n/a nM
Citation
 Wallace, OBLauwers, KSJones, SADodge, JA Tetrahydroquinoline-based selective estrogen receptor modulators (SERMs). Bioorg Med Chem Lett 13:1907-10 (2003)  
Target
Name:
Estrogen receptor beta
Synonyms:
Estrogen receptor
Type:
Mol. Mass.:
Description:
ASSAY_ID of ChEMBL is 99778
Components:
This complex has 2 components.
Component 1
Name:
Estrogen receptor beta
Synonyms:
ER-beta ESR2_HUMAN Estradiol receptor beta (ERβ) Estrogen receptor (ER beta) Estrogen receptor beta (ER beta) NR3A2 estrogen beta
Type:
Protein
Mol. Mass.:
59238.43
Organism:
Homo sapiens (Human)
Description:
Q92731
Residue:
530
  
Component 2
Name:
Estrogen receptor
Synonyms:
ER ESR ESR1_HUMAN Estrogen receptor Estrogen receptor (ER-alpha) Estrogen receptor alpha (ER) Nuclear receptor subfamily 3 group A member 1
Type:
Protein
Mol. Mass.:
66230.44
Organism:
Homo sapiens (Human)
Description:
P03372
Residue:
595
  
Inhibitor
Name:
BDBM50128393
Synonyms:
CHEMBL59311 | [6-Hydroxy-2-(3-hydroxy-phenyl)-3,4-dihydro-2H-quinolin-1-yl]-[4-(2-piperidin-1-yl-ethoxy)-phenyl]-methanone
Type:
Small organic molecule
Emp. Form.:
C29H32N2O4
Mol. Mass.:
472.5754
SMILES:
Oc1cccc(c1)C1CCc2cc(O)ccc2N1C(=O)c1ccc(OCCN2CCCCC2)cc1
: