Target
Ecdysone receptor
Ligand
BDBM50128481
Substrate
Meas. Tech.
ChEBML_65453
EC50
5320.0±n/a nM
Citation
 Smith, HCCavanaugh, CKFriz, JLThompson, CSSaggers, JAMichelotti, ELGarcia, JTice, CM Synthesis and SAR of cis-1-benzoyl-1,2,3,4-tetrahydroquinoline ligands for control of gene expression in ecdysone responsive systems. Bioorg Med Chem Lett 13:1943-6 (2003)  
Target
Name:
Ecdysone receptor
Synonyms:
20-hydroxy-ecdysone receptor AaEcR EcR Ecdysteroid receptor Nuclear receptor subfamily 1 group H member 1
Type:
PROTEIN
Mol. Mass.:
83656.95
Organism:
Aedes aegypti
Description:
ChEMBL_65453
Residue:
776
  
Inhibitor
Name:
BDBM50128481
Synonyms:
((2R,4S)-2,6-Dimethyl-4-p-tolylamino-3,4-dihydro-2H-quinolin-1-yl)-(4-methoxy-phenyl)-methanone | CHEMBL58056
Type:
Small organic molecule
Emp. Form.:
C26H28N2O2
Mol. Mass.:
400.5127
SMILES:
COc1ccc(cc1)C(=O)N1[C@H](C)C[C@H](Nc2ccc(C)cc2)c2cc(C)ccc12
: