Target
Ecdysone receptor
Ligand
BDBM50128496
Substrate
Meas. Tech.
ChEBML_65453
EC50
990±n/a nM
Citation
 Smith, HCCavanaugh, CKFriz, JLThompson, CSSaggers, JAMichelotti, ELGarcia, JTice, CM Synthesis and SAR of cis-1-benzoyl-1,2,3,4-tetrahydroquinoline ligands for control of gene expression in ecdysone responsive systems. Bioorg Med Chem Lett 13:1943-6 (2003)  
Target
Name:
Ecdysone receptor
Synonyms:
20-hydroxy-ecdysone receptor AaEcR EcR Ecdysteroid receptor Nuclear receptor subfamily 1 group H member 1
Type:
PROTEIN
Mol. Mass.:
83656.95
Organism:
Aedes aegypti
Description:
ChEMBL_65453
Residue:
776
  
Inhibitor
Name:
BDBM50128496
Synonyms:
((2R,4S)-2-Methyl-4-phenylamino-3,4-dihydro-2H-quinolin-1-yl)-p-tolyl-methanone | CHEMBL60877
Type:
Small organic molecule
Emp. Form.:
C24H24N2O
Mol. Mass.:
356.4602
SMILES:
C[C@@H]1C[C@H](Nc2ccccc2)c2ccccc2N1C(=O)c1ccc(C)cc1
: