Target
Proto-oncogene tyrosine-protein kinase Src
Ligand
BDBM50128848
Substrate
Meas. Tech.
ChEMBL_226200 (CHEMBL843326)
IC50
>1000±n/a nM
Citation
 Ikuina, YAmishiro, NMiyata, MNarumi, HOgawa, HAkiyama, TShiotsu, YAkinaga, SMurakata, C Synthesis and antitumor activity of novel O-carbamoylmethyloxime derivatives of radicicol. J Med Chem 46:2534-41 (2003)  
Target
Name:
Proto-oncogene tyrosine-protein kinase Src
Synonyms:
Proto-oncogene c-Src Src p60-Src | pp60c-src
Type:
PROTEIN
Mol. Mass.:
59976.76
Organism:
Rattus norvegicus
Description:
ChEMBL_453858
Residue:
536
  
Inhibitor
Name:
BDBM50128848
Synonyms:
2-(16-Chloro-17,19-dihydroxy-4-methyl-2-oxo-3,7-dioxa-tricyclo[13.4.0.0*6,8*]nonadeca-1(19),9,11,15,17-pentaen-13-ylideneaminooxy)-N-[2-(1-methyl-1H-pyrrol-2-yl)-ethyl]-acetamide | CHEMBL84564
Type:
Small organic molecule
Emp. Form.:
C27H30ClN3O7
Mol. Mass.:
543.996
SMILES:
C[C@@H]1C[C@H]2O[C@@H]2\C=C/C=C/C(/Cc2c(Cl)c(O)cc(O)c2C(=O)O1)=N\OCC(=O)NCCc1cccn1C
: