Target
Cathepsin K
Ligand
BDBM50113674
Substrate
Meas. Tech.
ChEBML_45551
IC50
9.0±n/a nM
Citation
 Altmann, EGreen, JTintelnot-Blomley, M Arylaminoethyl amides as inhibitors of the cysteine protease cathepsin K-investigating P1' substituents. Bioorg Med Chem Lett 13:1997-2001 (2003)  
Target
Name:
Cathepsin K
Synonyms:
CATK_HUMAN CTSO Cathepsin O Cathepsin X
Type:
Enzyme
Mol. Mass.:
36975.68
Organism:
Homo sapiens (Human)
Description:
P43235
Residue:
329
  
Inhibitor
Name:
BDBM50113674
Synonyms:
4-Methoxy-N-{(S)-1-[2-(4-methoxy-phenylamino)-ethylcarbamoyl]-3-methyl-butyl}-benzamide CHEMBL59605
Type:
Small organic molecule
Emp. Form.:
C23H31N3O4
Mol. Mass.:
413.5099
SMILES:
COc1ccc(NCCNC(=O)[C@H](CC(C)C)NC(=O)c2ccc(OC)cc2)cc1
: