Target
Cathepsin K
Ligand
BDBM19545
Substrate
Meas. Tech.
ChEBML_45551
IC50
372±n/a nM
Citation
 Altmann, EGreen, JTintelnot-Blomley, M Arylaminoethyl amides as inhibitors of the cysteine protease cathepsin K-investigating P1' substituents. Bioorg Med Chem Lett 13:1997-2001 (2003)  
Target
Name:
Cathepsin K
Synonyms:
CATK_HUMAN CTSO Cathepsin O Cathepsin X
Type:
Enzyme
Mol. Mass.:
36975.68
Organism:
Homo sapiens (Human)
Description:
P43235
Residue:
329
  
Inhibitor
Name:
BDBM19545
Synonyms:
(2S)-N-{2-[(4-methoxyphenyl)amino]ethyl}-4-methyl-2-[(3-methylphenyl)formamido]pentanamide arylaminoethyl amide, 1
Type:
Small organic molecule
Emp. Form.:
C23H31N3O3
Mol. Mass.:
397.5105
SMILES:
COc1ccc(NCCNC(=O)[C@H](CC(C)C)NC(=O)c2cccc(C)c2)cc1
: