Target
Cathepsin S
Ligand
BDBM50128949
Substrate
Meas. Tech.
ChEBML_48671
IC50
580±n/a nM
Citation
 Altmann, EGreen, JTintelnot-Blomley, M Arylaminoethyl amides as inhibitors of the cysteine protease cathepsin K-investigating P1' substituents. Bioorg Med Chem Lett 13:1997-2001 (2003)  
Target
Name:
Cathepsin S
Synonyms:
CATS_HUMAN Cathepsin S (Cat S) | cathepsin S preproprotein
Type:
Protein
Mol. Mass.:
37507.38
Organism:
Homo sapiens (Human)
Description:
P25774
Residue:
331
  
Inhibitor
Name:
BDBM50128949
Synonyms:
CHEMBL292472 | N-{(S)-1-[2-(4-Methoxy-phenylamino)-ethylcarbamoyl]-3-methyl-butyl}-4-methyl-benzamide
Type:
Small organic molecule
Emp. Form.:
C23H31N3O3
Mol. Mass.:
397.5105
SMILES:
COc1ccc(NCCNC(=O)[C@H](CC(C)C)NC(=O)c2ccc(C)cc2)cc1
: