Target
Procathepsin L
Ligand
BDBM50128949
Substrate
Meas. Tech.
ChEMBL_48366 (CHEMBL661682)
IC50
<30±n/a nM
Citation
 Altmann, EGreen, JTintelnot-Blomley, M Arylaminoethyl amides as inhibitors of the cysteine protease cathepsin K-investigating P1' substituents. Bioorg Med Chem Lett 13:1997-2001 (2003)  
Target
Name:
Procathepsin L
Synonyms:
CATL1_HUMAN CTSL CTSL1 Cathepsin L Cathepsin L1 heavy chain MEP cathepsin L preproprotein
Type:
Enzyme
Mol. Mass.:
37557.19
Organism:
Homo sapiens (Human)
Description:
Purchased from Calbiochem (San Diego, CA).
Residue:
333
  
Inhibitor
Name:
BDBM50128949
Synonyms:
CHEMBL292472 | N-{(S)-1-[2-(4-Methoxy-phenylamino)-ethylcarbamoyl]-3-methyl-butyl}-4-methyl-benzamide
Type:
Small organic molecule
Emp. Form.:
C23H31N3O3
Mol. Mass.:
397.5105
SMILES:
COc1ccc(NCCNC(=O)[C@H](CC(C)C)NC(=O)c2ccc(C)cc2)cc1
: