Target
Cathepsin S
Ligand
BDBM50129075
Substrate
Meas. Tech.
ChEBML_48676
Ki
950.0±n/a nM
Citation
 Setti, ELDavis, DChung, TMcCarter, J 3,4-disubstituted azetidinones as selective inhibitors of the cysteine protease cathepsin K. Exploring P2 elements for selectivity. Bioorg Med Chem Lett 13:2051-3 (2003)  
Target
Name:
Cathepsin S
Synonyms:
CATS_HUMAN Cathepsin S (Cat S) | cathepsin S preproprotein
Type:
Protein
Mol. Mass.:
37507.38
Organism:
Homo sapiens (Human)
Description:
P25774
Residue:
331
  
Inhibitor
Name:
BDBM50129075
Synonyms:
Acetic acid (2S,3S)-3-[(1-benzyloxycarbonylamino-cyclohexanecarbonyl)-amino]-4-oxo-azetidin-2-yl ester | CHEMBL62655
Type:
Small organic molecule
Emp. Form.:
C20H25N3O6
Mol. Mass.:
403.429
SMILES:
CC(=O)O[C@@H]1NC(=O)[C@H]1NC(=O)C1(CCCCC1)NC(=O)OCc1ccccc1
: