Target
Muscarinic acetylcholine receptor M1
Ligand
BDBM50129389
Substrate
Meas. Tech.
ChEBML_138407
Ki
14±n/a nM
Citation
 Ogino, YOhtake, NKobayashi, KKimura, TFujikawa, THasegawa, TNoguchi, KMase, T Muscarinic M(3) receptor antagonists with (2R)-2-[(1R)-3,3-difluorocyclopentyl]-2-hydroxyphenylacetamide Structures. Part 2. Bioorg Med Chem Lett 13:2167-72 (2003)  
Target
Name:
Muscarinic acetylcholine receptor M1
Synonyms:
ACM1_HUMAN Cholinergic receptor, muscarinic 1 | Cholinergic, muscarinic M1
Type:
Protein
Mol. Mass.:
51442.54
Organism:
Homo sapiens (Human)
Description:
P11229
Residue:
460
  
Inhibitor
Name:
BDBM50129389
Synonyms:
(R)-1-[1,4]Diazepan-1-yl-2-((R)-3,3-difluoro-cyclopentyl)-2-hydroxy-2-phenyl-ethanone | CHEMBL424416
Type:
Small organic molecule
Emp. Form.:
C18H24F2N2O2
Mol. Mass.:
338.3922
SMILES:
O[C@@]([C@@H]1CCC(F)(F)C1)(C(=O)N1CCCNCC1)c1ccccc1
: