Target
Vasopressin V1a receptor
Ligand
BDBM50129476
Substrate
Meas. Tech.
ChEBML_214555
IC50
56.0±n/a nM
Citation
 Sum, FWDusza, JSantos, EDGrosu, GReich, MDu, XAlbright, JDChan, PCoupet, JRu, XMazandarani, HSaunders, T Structure-activity study of novel tricyclic benzazepine arginine vasopressin antagonists. Bioorg Med Chem Lett 13:2195-8 (2003)  
Target
Name:
Vasopressin V1a receptor
Synonyms:
Avpr1a VASOPRESSIN V1A Vasopressin V1a receptor | Vasopressin receptor
Type:
Enzyme Catalytic Domain
Mol. Mass.:
47674.81
Organism:
RAT
Description:
VASOPRESSIN V1A AVPR1A RAT::P30560
Residue:
424
  
Inhibitor
Name:
BDBM50129476
Synonyms:
2-Methyl-N-[4-(6H-phenanthridine-5-carbonyl)-phenyl]-benzamide | CHEMBL72945
Type:
Small organic molecule
Emp. Form.:
C28H22N2O2
Mol. Mass.:
418.4865
SMILES:
Cc1ccccc1C(=O)Nc1ccc(cc1)C(=O)N1Cc2ccccc2-c2ccccc12
: