Target
Vasopressin V1a receptor
Ligand
BDBM50065115
Substrate
Meas. Tech.
ChEBML_214555
IC50
410±n/a nM
Citation
 Sum, FWDusza, JSantos, EDGrosu, GReich, MDu, XAlbright, JDChan, PCoupet, JRu, XMazandarani, HSaunders, T Structure-activity study of novel tricyclic benzazepine arginine vasopressin antagonists. Bioorg Med Chem Lett 13:2195-8 (2003)  
Target
Name:
Vasopressin V1a receptor
Synonyms:
Avpr1a VASOPRESSIN V1A Vasopressin V1a receptor | Vasopressin receptor
Type:
Enzyme Catalytic Domain
Mol. Mass.:
47674.81
Organism:
RAT
Description:
VASOPRESSIN V1A AVPR1A RAT::P30560
Residue:
424
  
Inhibitor
Name:
BDBM50065115
Synonyms:
3-chloro-4-(10,11-dihydro-5H-benzo[e]pyrrolo[1,2-a][1,4]diazepin-10-ylcarbonyl)-1-(5-fluoro-2-methylphenylcarboxamido)benzene Lixivaptan | N-[4-(5H,11H-Benzo[e]pyrrolo[1,2-a][1,4]diazepine-10-carbonyl)-3-chloro-phenyl]-5-fluoro-2-methyl-benzamide
Type:
Small organic molecule
Emp. Form.:
C27H21ClFN3O2
Mol. Mass.:
473.926
SMILES:
Cc1ccc(F)cc1C(=O)Nc1ccc(C(=O)N2Cc3cccn3Cc3ccccc23)c(Cl)c1
: