Target
mRNA cap guanine-N7 methyltransferase
Ligand
BDBM50378739
Substrate
Meas. Tech.
ChEMBL_2089929 (CHEMBL4771192)
IC50
<50±n/a nM
Citation
 Ahmed-Belkacem, RSutto-Ortiz, PGuiraud, MCanard, BVasseur, JJDecroly, EDebart, F Synthesis of adenine dinucleosides SAM analogs as specific inhibitors of SARS-CoV nsp14 RNA cap guanine-N7-methyltransferase. Eur J Med Chem 201:0 (2020)  
Target
Name:
mRNA cap guanine-N7 methyltransferase
Synonyms:
2.1.1.56 MCES_HUMAN RNMT hMet mRNA (guanine-N(7)-)-methyltransferase mRNA cap methyltransferase
Type:
PROTEIN
Mol. Mass.:
54843.48
Organism:
Homo sapiens
Description:
ChEMBL_117907
Residue:
476
  
Inhibitor
Name:
BDBM50378739
Synonyms:
SINEFUNGIN | jm2c00120, Sinefungin
Type:
Small organic molecule
Emp. Form.:
C15H23N7O5
Mol. Mass.:
381.387
SMILES:
N[C@@H](CC[C@H](N)C(O)=O)C[C@H]1O[C@H]([C@H](O)[C@@H]1O)n1cnc2c(N)ncnc12
: