Target
Peroxisome proliferator-activated receptor gamma/Retinoic acid receptor RXR-alpha
Ligand
BDBM50032671
Substrate
Meas. Tech.
ChEMBL_44334 (CHEMBL651610)
EC50
38±n/a nM
Citation
 Michellys, PYArdecky, RJChen, JHCrombie, DLEtgen, GJFaul, MMFaulkner, ALGrese, TAHeyman, RAKaranewsky, DSKlausing, KLeibowitz, MDLiu, SMais, DAMapes, CMMarschke, KBReifel-Miller, AOgilvie, KMRungta, DThompson, AWTyhonas, JSBoehm, MF Novel (2E,4E,6Z)-7-(2-alkoxy-3,5-dialkylbenzene)-3-methylocta-2,4,6-trienoic acid retinoid X receptor modulators are active in models of type 2 diabetes. J Med Chem 46:2683-96 (2003)  
Target
Name:
Peroxisome proliferator-activated receptor gamma/Retinoic acid receptor RXR-alpha
Synonyms:
Peroxisome Proliferator-Activated Receptor gamma/Retinoid X receptor alpha | RXR alpha/PPAR gamma
Type:
Mol. Mass.:
Description:
ASSAY_ID of EBI is 43803
Components:
This complex has 3 components.
Component 1
Name:
Peroxisome proliferator-activated receptor gamma
Synonyms:
NR1C3 PPAR-gamma PPARG_HUMAN Peroxisome proliferator-activated receptor gamma (PPAR gamma) Peroxisome proliferator-activated receptor gamma (PPARĪ³) peroxisome proliferator-activated receptor gamma isoform 2
Type:
Nuclear Receptor
Mol. Mass.:
57613.46
Organism:
Homo sapiens (Human)
Description:
P37231
Residue:
505
  
Component 2
Name:
Retinoic acid receptor RXR-alpha
Synonyms:
NR2B1 Nuclear receptor subfamily 4 group A member 2 RXRA Retinoic acid receptor RXR-alpha/gamma Retinoid receptor
Type:
PROTEIN
Mol. Mass.:
50820.38
Organism:
Homo sapiens (Human)
Description:
ChEMBL_1456363
Residue:
462
  
Inhibitor
Name:
BDBM50032671
Synonyms:
6-[1-(3,5,5,8,8-PENTAMETHYL-5,6,7,8-TETRAHYDRONAPHTHALEN-2-YL)CYCLOPROPYL]PYRIDINE-3-CARBOXYLIC ACID CHEMBL288436
Type:
Small organic molecule
Emp. Form.:
C24H29NO2
Mol. Mass.:
363.4926
SMILES:
Cc1cc2c(cc1C1(CC1)c1ccc(cn1)C(O)=O)C(C)(C)CCC2(C)C
: