Target
5-hydroxytryptamine receptor 1A
Ligand
BDBM50130151
Substrate
Meas. Tech.
ChEMBL_892 (CHEMBL835002)
Ki
16±n/a nM
Citation
 Takeuchi, KKohn, TJHonigschmidt, NARocco, VPSpinazze, PGKoch, DJAtkinson, STHertel, LWNelson, DLWainscott, DBAhmad, LJShaw, JThrelkeld, PGWong, DT Advances Toward new antidepressants beyond SSRIs: 1-aryloxy-3-piperidinylpropan-2-ols with dual 5-HT(1A) receptor antagonism/SSRI activities. Part 2. Bioorg Med Chem Lett 13:2393-7 (2003)  
Target
Name:
5-hydroxytryptamine receptor 1A
Synonyms:
5-HT-1A 5-hydroxytryptamine receptor 1A (5-HT-1A) ADRB2RL1 Dopamine D2 receptor and serotonin 1a receptor HTR1A | Serotonin receptor 1A
Type:
Mol. Mass.:
46122.49
Organism:
Homo sapiens (Human)
Description:
Residue:
422
  
Inhibitor
Name:
BDBM50130151
Synonyms:
(S)-1-[(4S,6S)-4-(5-Fluoro-benzo[b]thiophen-2-yl)-2-methyl-piperidin-1-yl]-3-(1H-indol-4-yloxy)-propan-2-ol | CHEMBL78202
Type:
Small organic molecule
Emp. Form.:
C25H27FN2O2S
Mol. Mass.:
438.557
SMILES:
C[C@H]1C[C@H](CCN1C[C@H](O)COc1cccc2[nH]ccc12)c1cc2cc(F)ccc2s1
: