Target
Sodium-dependent serotonin transporter
Ligand
BDBM50130156
Substrate
Meas. Tech.
ChEBML_201993
Ki
2.2±n/a nM
Citation
 Takeuchi, KKohn, TJHonigschmidt, NARocco, VPSpinazze, PGKoch, DJAtkinson, STHertel, LWNelson, DLWainscott, DBAhmad, LJShaw, JThrelkeld, PGWong, DT Advances Toward new antidepressants beyond SSRIs: 1-aryloxy-3-piperidinylpropan-2-ols with dual 5-HT(1A) receptor antagonism/SSRI activities. Part 2. Bioorg Med Chem Lett 13:2393-7 (2003)  
Target
Name:
Sodium-dependent serotonin transporter
Synonyms:
5-HT Transporter 5HT transporter Anandamid membrane transporter, AMT Monoamine transporters; Norepinephrine & serotonin Slc6a4 Sodium-dependent serotonin transporter (SERT) | imipramine receptor
Type:
Multi-pass membrane protein
Mol. Mass.:
70168.43
Organism:
Rattus norvegicus (rat)
Description:
P31652
Residue:
630
  
Inhibitor
Name:
BDBM50130156
Synonyms:
(S)-1-(1H-Indol-4-yloxy)-3-[(4S,6R)-2-methyl-4-(6-methyl-benzo[b]thiophen-2-yl)-piperidin-1-yl]-propan-2-ol | CHEMBL80678
Type:
Small organic molecule
Emp. Form.:
C26H30N2O2S
Mol. Mass.:
434.594
SMILES:
C[C@H]1C[C@@H](CCN1C[C@H](O)COc1cccc2[nH]ccc12)c1cc2ccc(C)cc2s1
: