Target
5-hydroxytryptamine receptor 1A
Ligand
BDBM50130158
Substrate
Meas. Tech.
ChEMBL_892 (CHEMBL835002)
Ki
16±n/a nM
Citation
 Takeuchi, KKohn, TJHonigschmidt, NARocco, VPSpinazze, PGKoch, DJAtkinson, STHertel, LWNelson, DLWainscott, DBAhmad, LJShaw, JThrelkeld, PGWong, DT Advances Toward new antidepressants beyond SSRIs: 1-aryloxy-3-piperidinylpropan-2-ols with dual 5-HT(1A) receptor antagonism/SSRI activities. Part 2. Bioorg Med Chem Lett 13:2393-7 (2003)  
Target
Name:
5-hydroxytryptamine receptor 1A
Synonyms:
5-HT-1A 5-hydroxytryptamine receptor 1A (5-HT-1A) ADRB2RL1 Dopamine D2 receptor and serotonin 1a receptor HTR1A | Serotonin receptor 1A
Type:
Mol. Mass.:
46122.49
Organism:
Homo sapiens (Human)
Description:
Residue:
422
  
Inhibitor
Name:
BDBM50130158
Synonyms:
(S)-1-(1H-Indol-4-yloxy)-3-[(4S,6S)-4-(4-methoxy-benzo[b]thiophen-2-yl)-2-methyl-piperidin-1-yl]-propan-2-ol CHEMBL310883
Type:
Small organic molecule
Emp. Form.:
C26H30N2O3S
Mol. Mass.:
450.593
SMILES:
COc1cccc2sc(cc12)[C@H]1CCN(C[C@H](O)COc2cccc3[nH]ccc23)[C@@H](C)C1
: