Target
Transient receptor potential cation channel subfamily V member 1
Ligand
BDBM50130551
Substrate
Meas. Tech.
ChEMBL_215652 (CHEMBL820262)
Ki
3000±n/a nM
Citation
 Lee, JLee, JKang, MShin, MKim, JMKang, SULim, JOChoi, HKSuh, YGPark, HGOh, UKim, HDPark, YHHa, HJKim, YHToth, AWang, YTran, RPearce, LVLundberg, DJBlumberg, PM N-(3-acyloxy-2-benzylpropyl)-N'-[4-(methylsulfonylamino)benzyl]thiourea analogues: novel potent and high affinity antagonists and partial antagonists of the vanilloid receptor. J Med Chem 46:3116-26 (2003)  
Target
Name:
Transient receptor potential cation channel subfamily V member 1
Synonyms:
Capsaicin receptor TRPV1_RAT Trpv1 Vanilloid VR1 Vanilloid receptor 1 (VRI/TRPV1) Vanilloid receptor type 1-like (TrpV1/Vr1) Vr1l | osm-9-like TRP channel 1
Type:
Transient Receptor
Mol. Mass.:
94956.12
Organism:
Rattus norvegicus (rat)
Description:
O35433
Residue:
838
  
Inhibitor
Name:
BDBM50130551
Synonyms:
2,2-Dimethyl-propionic acid 2-(3,4-dimethyl-benzyl)-3-{3-[4-(methanesulfonylamino-methyl)-benzyl]-thioureido}-propyl ester | CHEMBL107115
Type:
Small organic molecule
Emp. Form.:
C27H39N3O4S2
Mol. Mass.:
533.746
SMILES:
Cc1ccc(CC(CNC(=S)NCc2ccc(CNS(C)(=O)=O)cc2)COC(=O)C(C)(C)C)cc1C
: