Target
Mu-type opioid receptor
Ligand
BDBM50130616
Substrate
Meas. Tech.
ChEMBL_148859 (CHEMBL756655)
Ki
1530±n/a nM
Citation
 Okada, YTsuda, YFujita, YYokoi, TSasaki, YAmbo, AKonishi, RNagata, MSalvadori, SJinsmaa, YBryant, SDLazarus, LH Unique high-affinity synthetic mu-opioid receptor agonists with central- and systemic-mediated analgesia. J Med Chem 46:3201-9 (2003)  
Target
Name:
Mu-type opioid receptor
Synonyms:
MOR-1 Mu-type opioid receptor (MOR) OPRM_RAT Opioid receptor B Ror-b
Type:
G Protein-Coupled Receptor (GPCR)
Mol. Mass.:
44503.11
Organism:
Rattus norvegicus (rat)
Description:
Competition binding assays were carried out using membrane preparations from transfected HN9.10 cells that constitutively expressed the mu opioid receptor.
Residue:
398
  
Inhibitor
Name:
BDBM50130616
Synonyms:
2-Amino-N-[4-(2-amino-3-phenyl-propionylamino)-butyl]-3-phenyl-propionamide | CHEMBL110214
Type:
Small organic molecule
Emp. Form.:
C22H30N4O2
Mol. Mass.:
382.4992
SMILES:
N[C@@H](Cc1ccccc1)C(=O)NCCCCNC(=O)[C@H](N)Cc1ccccc1
: