Target
Protein-tyrosine-phosphatase
Ligand
BDBM50131094
Substrate
Meas. Tech.
ChEBML_210868
IC50
82000±n/a nM
Citation
 Lee, KGao, YYao, ZJPhan, JWu, LLiang, JWaugh, DSZhang, ZYBurke, TR Tripeptide inhibitors of Yersinia protein-tyrosine phosphatase. Bioorg Med Chem Lett 13:2577-81 (2003)  
Target
Name:
Protein-tyrosine-phosphatase
Synonyms:
Secreted effector protein | Secreted protein-tyrosine phosphatase
Type:
PROTEIN
Mol. Mass.:
50881.86
Organism:
Yersinia pestis
Description:
ChEMBL_810616
Residue:
468
  
Inhibitor
Name:
BDBM50131094
Synonyms:
2-{4-[(S)-2-[(S)-4-Benzyloxycarbonyl-2-(9H-fluoren-9-ylmethoxycarbonylamino)-butyrylamino]-2-((S)-1-carbamoyl-3-methyl-butylcarbamoyl)-ethyl]-phenoxy}-malonic acid | CHEMBL87399
Type:
Small organic molecule
Emp. Form.:
C45H48N4O12
Mol. Mass.:
836.8822
SMILES:
CC(C)C[C@H](NC(=O)[C@H](Cc1ccc(OC(C(O)=O)C(O)=O)cc1)NC(=O)[C@H](CCC(=O)OCc1ccccc1)NC(=O)OCC1c2ccccc2-c2ccccc12)C(N)=O
: