Target
Matrix metalloproteinase-9
Ligand
BDBM50131516
Substrate
Meas. Tech.
ChEBML_105519
IC50
753±n/a nM
Citation
 Levin, JIChen, JMCheung, KCole, DCrago, CSantos, EDDu, XKhafizova, GMacEwan, GNiu, CSalaski, EJZask, ACummons, TSung, AXu, JZhang, YXu, WAyral-Kaloustian, SJin, GCowling, RBarone, DMohler, KMBlack, RASkotnicki, JS Acetylenic TACE inhibitors. Part 1. SAR of the acyclic sulfonamide hydroxamates. Bioorg Med Chem Lett 13:2799-803 (2003)  
Target
Name:
Matrix metalloproteinase-9
Synonyms:
67 kDa matrix metalloproteinase-9 92 kDa gelatinase CLG4B Gelatinase B MMP9 Matrix metalloproteinase 9 (MMP-9) Matrix metalloproteinase-9 (MMP9)
Type:
Enzyme
Mol. Mass.:
78452.28
Organism:
Homo sapiens (Human)
Description:
P14780
Residue:
707
  
Inhibitor
Name:
BDBM50131516
Synonyms:
2-(4-(but-2-ynyloxy)phenylsulfonamido)-N-hydroxyacetamide CHEMBL94715
Type:
Small organic molecule
Emp. Form.:
C12H14N2O5S
Mol. Mass.:
298.315
SMILES:
CC#CCOc1ccc(cc1)S(=O)(=O)NCC(=O)NO
: