Target
Tyrosine-protein phosphatase non-receptor type 1
Ligand
BDBM50131546
Substrate
Meas. Tech.
ChEMBL_162277 (CHEMBL770975)
Ki
370±n/a nM
Citation
 Liu, GXin, ZLiang, HAbad-Zapatero, CHajduk, PJJanowick, DASzczepankiewicz, BGPei, ZHutchins, CWBallaron, SJStashko, MALubben, THBerg, CERondinone, CMTrevillyan, JMJirousek, MR Selective protein tyrosine phosphatase 1B inhibitors: targeting the second phosphotyrosine binding site with non-carboxylic acid-containing ligands. J Med Chem 46:3437-40 (2003)  
Target
Name:
Tyrosine-protein phosphatase non-receptor type 1
Synonyms:
PTN1_HUMAN PTPN1 Protein tyrosine phosphatase-1B (PTP1B) Protein-tyrosine phosphatase 1B (PTP1B) Tyrosine-protein phosphatase non-receptor type 1 (PTP1B)
Type:
Protein phosphatase
Mol. Mass.:
49963.76
Organism:
Homo sapiens (Human)
Description:
Human recombinant GST-fusion PTP1B (1-435).
Residue:
435
  
Inhibitor
Name:
BDBM50131546
Synonyms:
2-[(4-{2-Acetylamino-2-[4-(3-hydroxy-2-methylcarbamoyl-phenoxy)-butylcarbamoyl]-ethyl}-2-ethyl-phenyl)-oxalyl-amino]-benzoic acid | CHEMBL116901
Type:
Small organic molecule
Emp. Form.:
C34H38N4O10
Mol. Mass.:
662.6863
SMILES:
CCc1cc(CC(NC(C)=O)C(=O)NCCCCOc2cccc(O)c2C(=O)NC)ccc1N(C(=O)C(O)=O)c1ccccc1C(O)=O
: