Target
Prostaglandin G/H synthase 2
Ligand
BDBM50131585
Substrate
Meas. Tech.
ChEMBL_159893 (CHEMBL766721)
IC50
4±n/a nM
Citation
 Almansa, CAlfón, Jde Arriba, AFCavalcanti, FLEscamilla, IGómez, LAMiralles, ASoliva, RBartrolí, JCarceller, EMerlos, MGarcía-Rafanell, J Synthesis and structure-activity relationship of a new series of COX-2 selective inhibitors: 1,5-diarylimidazoles. J Med Chem 46:3463-75 (2003)  
Target
Name:
Prostaglandin G/H synthase 2
Synonyms:
COX2 Cyclooxygenase 2 (COX-2) Cyclooxygenase-2 (COX-2 AA) Cyclooxygenase-2 (COX-2) PGH2_HUMAN PHS II Prostaglandin E synthase/G/H synthase 2 Prostaglandin-endoperoxide synthase 2
Type:
Enzyme
Mol. Mass.:
69003.89
Organism:
Homo sapiens (Human)
Description:
Recombinant Cox-2 provided by Cayman (Cayman Chemical Co.,Ann Arbor, MI).
Residue:
604
  
Inhibitor
Name:
BDBM50131585
Synonyms:
4-Chloro-5-(4-ethoxy-phenyl)-1-(4-methanesulfonyl-phenyl)-1H-imidazole | CHEMBL324509
Type:
Small organic molecule
Emp. Form.:
C18H17ClN2O3S
Mol. Mass.:
376.857
SMILES:
CCOc1ccc(cc1)-c1c(Cl)ncn1-c1ccc(cc1)S(C)(=O)=O
: