Target
5-hydroxytryptamine receptor 2C
Ligand
BDBM50005257
Substrate
Meas. Tech.
ChEMBL_2839 (CHEMBL621525)
Ki
2.8±n/a nM
Citation
 Chambers, JJParrish, JCJensen, NHKurrasch-Orbaugh, DMMarona-Lewicka, DNichols, DE Synthesis and pharmacological characterization of a series of geometrically constrained 5-HT(2A/2C) receptor ligands. J Med Chem 46:3526-35 (2003)  
Target
Name:
5-hydroxytryptamine receptor 2C
Synonyms:
5-HT2C 5-hydroxytryptamine receptor 2C (5HT2c) 5ht1c Htr2c Serotonin receptor 2a and 2c (5HT2A and 5HT2C)
Type:
Enzyme
Mol. Mass.:
51935.10
Organism:
Rattus norvegicus (Rat)
Description:
P08909
Residue:
460
  
Inhibitor
Name:
BDBM50005257
Synonyms:
(+)-2-(4-Bromo-2,5-dimethoxy-phenyl)-1-methyl-ethylamine (+/-)2-(4-Bromo-2,5-dimethoxy-phenyl)-1-methyl-ethylamine (-)2-(4-Bromo-2,5-dimethoxy-phenyl)-1-methyl-ethylamine 2-(2-Methoxy-phenyl)-1-methyl-ethylamine 2-(4-Bromo-2,5-dimethoxy-phenyl)-1-methyl-ethylamine((-)-DOB) 2-(4-Bromo-2,5-dimethoxy-phenyl)-1-methyl-ethylamine((S)-(+)-DOB) 2-(4-Bromo-2,5-dimethoxy-phenyl)-1-methyl-ethylamine[R(-)DOB] Brolamfetamine DOB | Racemic DOB
Type:
Small organic molecule
Emp. Form.:
C11H16BrNO2
Mol. Mass.:
274.154
SMILES:
COc1cc(CC(C)N)c(OC)cc1Br
: