Target
5-hydroxytryptamine receptor 1A
Ligand
BDBM50131706
Substrate
Meas. Tech.
ChEMBL_1120 (CHEMBL616065)
Ki
2.47±n/a nM
Citation
 Betti, LCorelli, FFloridi, MGiannaccini, GMaccari, LManetti, FStrappaghetti, GBotta, M Alpha1-adrenoceptor antagonists. 6. Structural optimization of pyridazinone-arylpiperazines. Study of the influence on affinity and selectivity of cyclic substituents at the pyridazinone ring and alkoxy groups at the arylpiperazine moiety. J Med Chem 46:3555-8 (2003)  
Target
Name:
5-hydroxytryptamine receptor 1A
Synonyms:
5-HT-1A 5-HT1A 5-hydroxytryptamine receptor 1A (5HT1A) 5ht1a Htr1a Serotonin 1a (5-HT1a) receptor/Adrenergic receptor alpha-1 | Serotonin receptor 1A
Type:
G Protein-Coupled Receptor (GPCR)
Mol. Mass.:
46445.29
Organism:
Rattus norvegicus (rat)
Description:
Binding assays were performed using rat hippocampal membranes.
Residue:
422
  
Inhibitor
Name:
BDBM50131706
Synonyms:
4-Chloro-5-[4-(2,3-dihydro-benzo[1,4]dioxin-2-ylmethyl)-piperazin-1-yl]-2-{7-[4-(2-isopropoxy-phenyl)-piperazin-1-yl]-heptyl}-2H-pyridazin-3-one CHEMBL117996
Type:
Small organic molecule
Emp. Form.:
C37H51ClN6O4
Mol. Mass.:
679.292
SMILES:
CC(C)Oc1ccccc1N1CCN(CCCCCCCn2ncc(N3CCN(CC4COc5ccccc5O4)CC3)c(Cl)c2=O)CC1
: