Target
Alkaline phosphatase, germ cell type
Ligand
BDBM50131865
Substrate
Meas. Tech.
ChEMBL_157081 (CHEMBL765525)
Ki
330000±n/a nM
Citation
 Swierczek, KPandey, ASPeters, JWHengge, AC A comparison of phosphonothioic acids with phosphonic acids as phosphatase inhibitors. J Med Chem 46:3703-8 (2003)  
Target
Name:
Alkaline phosphatase, germ cell type
Synonyms:
ALPG ALPPL2 PPBN_HUMAN | placental-like alkaline phosphatase preproprotein
Type:
PROTEIN
Mol. Mass.:
57374.31
Organism:
Homo sapiens (Human)
Description:
ChEMBL_29964
Residue:
532
  
Inhibitor
Name:
BDBM50131865
Synonyms:
6-Thiophosphono-hexanoic acid methyl ester | CHEMBL123931
Type:
Small organic molecule
Emp. Form.:
C7H15O4PS
Mol. Mass.:
226.23
SMILES:
COC(=O)CCCCCP(O)(O)=S
: