Target
Inositol-trisphosphate 3-kinase A
Ligand
BDBM50075651
Substrate
Meas. Tech.
ChEBML_90112
IC50
27800±n/a nM
Citation
 Kwon, YUIm, JChoi, GKim, YSChoi, KYChung, SK Synthesis of three enantiomeric pairs of scyllo-inositol phosphate and molecular interactions between all possible regioisomers of scyllo-inositol phosphate and inositol 1,4,5-trisphosphate 3-kinase. Bioorg Med Chem Lett 13:2981-4 (2003)  
Target
Name:
Inositol-trisphosphate 3-kinase A
Synonyms:
IP3KA_RAT | Itpka
Type:
PROTEIN
Mol. Mass.:
50877.10
Organism:
Rattus norvegicus
Description:
ChEMBL_90112
Residue:
459
  
Inhibitor
Name:
BDBM50075651
Synonyms:
1D-myo-inositol 1,3,4,5-tetrakis(dihydrogen phosphate) CHEMBL23552
Type:
Small organic molecule
Emp. Form.:
C6H16O18P4
Mol. Mass.:
500.0755
SMILES:
O[C@H]1[C@@H](OP(O)(O)=O)[C@H](O)[C@@H](OP(O)(O)=O)[C@H](OP(O)(O)=O)[C@H]1OP(O)(O)=O
: