Target
Proto-oncogene tyrosine-protein kinase Src
Ligand
BDBM50221656
Substrate
Meas. Tech.
ChEMBL_202617 (CHEMBL805362)
IC50
20±n/a nM
Citation
 Sundaramoorthi, RShakespeare, WCKeenan, TPMetcalf, CAWang, YMani, UTaylor, MLiu, SBohacek, RSNarula, SSDalgarno, DCvan Schravandijk, MRViolette, SMLiou, SAdams, SRam, MKKeats, JAWeigle, MSawyer, TKWeigele, M Bone-targeted Src kinase inhibitors: novel pyrrolo- and pyrazolopyrimidine analogues. Bioorg Med Chem Lett 13:3063-6 (2003)  
Target
Name:
Proto-oncogene tyrosine-protein kinase Src
Synonyms:
Calmodulin/Proto-oncogene tyrosine-protein kinase Src Proto-oncogene c-Src SRC SRC_HUMAN V-src sarcoma (Schmidt-Ruppin A-2) viral oncogene homolog (avian) p60-Src | pp60c-src
Type:
Protein
Mol. Mass.:
59838.60
Organism:
Homo sapiens (Human)
Description:
P12931
Residue:
536
  
Inhibitor
Name:
BDBM50221656
Synonyms:
CHEMBL3706663
Type:
Small organic molecule
Emp. Form.:
C19H16N5O5P
Mol. Mass.:
425.3346
SMILES:
Nc1ncnc2n(nc(-c3cccc(O)c3)c12)-c1cccc(c1)P(O)(=O)CC(O)=O
: