Target
Tyrosine-protein kinase JAK3
Ligand
BDBM17015
Substrate
Meas. Tech.
ChEBML_91950
IC50
900±n/a nM
Citation
 Adams, CAldous, DJAmendola, SBamborough, PBright, CCrowe, SEastwood, PFenton, GFoster, MHarrison, TKKing, SLai, JLawrence, CLetallec, JPMcCarthy, CMoorcroft, NPage, KRao, SRedford, JSadiq, SSmith, KSouness, JEThurairatnam, SVine, MWyman, B Mapping the kinase domain of Janus Kinase 3. Bioorg Med Chem Lett 13:3105-10 (2003)  
Target
Name:
Tyrosine-protein kinase JAK3
Synonyms:
JAK-3 JAK3_HUMAN Janus kinase 3 (JAK3) L-JAK | Leukocyte janus kinase
Type:
Protein
Mol. Mass.:
125111.08
Organism:
Homo sapiens (Human)
Description:
P52333
Residue:
1124
  
Inhibitor
Name:
BDBM17015
Synonyms:
(3Z)-3-(1H-pyrrol-2-ylmethylidene)-2,3-dihydro-1H-indol-2-one Indolinone based inhibitor, 1 | Oxindole I
Type:
Small organic molecule
Emp. Form.:
C13H10N2O
Mol. Mass.:
210.2313
SMILES:
O=C1Nc2ccccc2\C1=C\c1ccc[nH]1
: