Target
Tyrosine-protein phosphatase non-receptor type 22
Ligand
BDBM50132462
Substrate
Meas. Tech.
ChEBML_207577
Ki
>30000±n/a nM
Citation
 Pei, ZLi, XLiu, GAbad-Zapatero, CLubben, TZhang, TBallaron, SJHutchins, CWTrevillyan, JMJirousek, MR Discovery and SAR of novel, potent and selective protein tyrosine phosphatase 1B inhibitors. Bioorg Med Chem Lett 13:3129-32 (2003)  
Target
Name:
Tyrosine-protein phosphatase non-receptor type 22
Synonyms:
3.1.3.48 LyP Lymphoid phosphatase (Lyp) PEST-domain phosphatase PTPN22 Tyrosine-protein phosphatase non-receptor type 22 (LYP) | tyrosine-protein phosphatase non-receptor type 22 isoform 1
Type:
Mol. Mass.:
91712.31
Organism:
Homo sapiens (Human)
Description:
Q9Y2R2
Residue:
807
  
Inhibitor
Name:
BDBM50132462
Synonyms:
5-{(S)-2-tert-Butoxycarbonylamino-2-[4-(2-methoxycarbonyl-3-hydroxy-phenoxy)-butylcarbamoyl]-ethyl}-2-carboxymethoxy-benzoic acid | CHEMBL107672
Type:
Small organic molecule
Emp. Form.:
C29H36N2O12
Mol. Mass.:
604.6023
SMILES:
COC(=O)c1c(O)cccc1OCCCCNC(=O)[C@H](Cc1ccc(OCC(O)=O)c(c1)C(O)=O)NC(=O)OC(C)(C)C
: