Target
Tyrosine-protein phosphatase non-receptor type 1
Ligand
BDBM50132462
Substrate
Meas. Tech.
ChEBML_162417
Ki
2100±n/a nM
Citation
 Pei, ZLi, XLiu, GAbad-Zapatero, CLubben, TZhang, TBallaron, SJHutchins, CWTrevillyan, JMJirousek, MR Discovery and SAR of novel, potent and selective protein tyrosine phosphatase 1B inhibitors. Bioorg Med Chem Lett 13:3129-32 (2003)  
Target
Name:
Tyrosine-protein phosphatase non-receptor type 1
Synonyms:
PTN1_HUMAN PTPN1 Protein tyrosine phosphatase-1B (PTP1B) Protein-tyrosine phosphatase 1B (PTP1B) Tyrosine-protein phosphatase non-receptor type 1 (PTP1B)
Type:
Protein phosphatase
Mol. Mass.:
49963.76
Organism:
Homo sapiens (Human)
Description:
Human recombinant GST-fusion PTP1B (1-435).
Residue:
435
  
Inhibitor
Name:
BDBM50132462
Synonyms:
5-{(S)-2-tert-Butoxycarbonylamino-2-[4-(2-methoxycarbonyl-3-hydroxy-phenoxy)-butylcarbamoyl]-ethyl}-2-carboxymethoxy-benzoic acid | CHEMBL107672
Type:
Small organic molecule
Emp. Form.:
C29H36N2O12
Mol. Mass.:
604.6023
SMILES:
COC(=O)c1c(O)cccc1OCCCCNC(=O)[C@H](Cc1ccc(OCC(O)=O)c(c1)C(O)=O)NC(=O)OC(C)(C)C
: