Target
M-phase inducer phosphatase 3
Ligand
BDBM50132461
Substrate
Meas. Tech.
ChEBML_49196
Ki
>30000±n/a nM
Citation
 Pei, ZLi, XLiu, GAbad-Zapatero, CLubben, TZhang, TBallaron, SJHutchins, CWTrevillyan, JMJirousek, MR Discovery and SAR of novel, potent and selective protein tyrosine phosphatase 1B inhibitors. Bioorg Med Chem Lett 13:3129-32 (2003)  
Target
Name:
M-phase inducer phosphatase 3
Synonyms:
CDC25C M-phase inducer phosphatase 3 | MPIP3_HUMAN
Type:
Substrate
Mol. Mass.:
53366.11
Organism:
Homo sapiens (Human)
Description:
P30307
Residue:
473
  
Inhibitor
Name:
BDBM50132461
Synonyms:
2-(4-{2-tert-Butoxycarbonylamino-2-[4-(3-hydroxy-2-methoxycarbonyl-phenoxy)-butylcarbamoyl]-ethyl}-phenoxy)-malonic acid | CHEMBL104371
Type:
Small organic molecule
Emp. Form.:
C29H36N2O12
Mol. Mass.:
604.6023
SMILES:
COC(=O)c1c(O)cccc1OCCCCNC(=O)C(Cc1ccc(OC(C(O)=O)C(O)=O)cc1)NC(=O)OC(C)(C)C
: