Target
5-hydroxytryptamine receptor 6
Ligand
BDBM50106250
Substrate
Meas. Tech.
ChEBML_3617
Ki
4.1±n/a nM
Citation
 Pullagurla, MRDukat, MSetola, VRoth, BGlennon, RA N1-benzenesulfonylgramine and N1-benzenesulfonylskatole: novel 5-HT6 receptor ligand templates. Bioorg Med Chem Lett 13:3355-9 (2003)  
Target
Name:
5-hydroxytryptamine receptor 6
Synonyms:
5-HT-6 5-hydroxytryptamine receptor 6 (5-HT-6) 5-hydroxytryptamine receptor 6 (5HT6) HTR6 Serotonin 6 (5-HT6) receptor | Serotonin Receptor 6
Type:
G Protein-Coupled Receptor (GPCR)
Mol. Mass.:
46968.43
Organism:
Homo sapiens (Human)
Description:
P50406
Residue:
440
  
Inhibitor
Name:
BDBM50106250
Synonyms:
CHEMBL93868 [2-(1-Benzenesulfonyl-1H-indol-3-yl)-ethyl]-dimethyl-amine
Type:
Small organic molecule
Emp. Form.:
C18H20N2O2S
Mol. Mass.:
328.429
SMILES:
CN(C)CCc1cn(c2ccccc12)S(=O)(=O)c1ccccc1
: