Target
Retinoic acid receptor RXR-alpha
Ligand
BDBM50032671
Substrate
Meas. Tech.
ChEMBL_196892 (CHEMBL807544)
EC50
11±n/a nM
Citation
 Michellys, PYArdecky, RJChen, JHD'Arrigo, JGrese, TAKaranewsky, DSLeibowitz, MDLiu, SMais, DAMapes, CMMontrose-Rafizadeh, COgilvie, KMReifel-Miller, ARungta, DThompson, AWTyhonas, JSBoehm, MF Design, synthesis, and structure-activity relationship studies of novel 6,7-locked-[7-(2-alkoxy-3,5-dialkylbenzene)-3-methylocta]-2,4,6-trienoic acids. J Med Chem 46:4087-103 (2003)  
Target
Name:
Retinoic acid receptor RXR-alpha
Synonyms:
NR2B Channel Blocker RXRA_RAT Retinoid X receptor alpha | Rxra
Type:
Enzyme Catalytic Domain
Mol. Mass.:
51273.78
Organism:
RAT
Description:
NR2B Channel Blocker 0 RAT::Q05343
Residue:
467
  
Inhibitor
Name:
BDBM50032671
Synonyms:
6-[1-(3,5,5,8,8-PENTAMETHYL-5,6,7,8-TETRAHYDRONAPHTHALEN-2-YL)CYCLOPROPYL]PYRIDINE-3-CARBOXYLIC ACID CHEMBL288436
Type:
Small organic molecule
Emp. Form.:
C24H29NO2
Mol. Mass.:
363.4926
SMILES:
Cc1cc2c(cc1C1(CC1)c1ccc(cn1)C(O)=O)C(C)(C)CCC2(C)C
: