Target
Retinoic acid receptor RXR-gamma
Ligand
BDBM50133121
Substrate
Meas. Tech.
ChEMBL_197230 (CHEMBL801376)
Ki
6.9±n/a nM
Citation
 Michellys, PYArdecky, RJChen, JHD'Arrigo, JGrese, TAKaranewsky, DSLeibowitz, MDLiu, SMais, DAMapes, CMMontrose-Rafizadeh, COgilvie, KMReifel-Miller, ARungta, DThompson, AWTyhonas, JSBoehm, MF Design, synthesis, and structure-activity relationship studies of novel 6,7-locked-[7-(2-alkoxy-3,5-dialkylbenzene)-3-methylocta]-2,4,6-trienoic acids. J Med Chem 46:4087-103 (2003)  
Target
Name:
Retinoic acid receptor RXR-gamma
Synonyms:
Nr2b3 Retinoid X receptor gamma | Rxrg
Type:
PROTEIN
Mol. Mass.:
50901.38
Organism:
Rattus norvegicus
Description:
ChEMBL_197230
Residue:
463
  
Inhibitor
Name:
BDBM50133121
Synonyms:
5-{3-[3-tert-Butyl-2-(2,2-difluoro-ethoxy)-5-ethyl-phenyl]-thiophen-2-yl}-3-methyl-penta-2,4-dienoic acid | CHEMBL129887
Type:
Small organic molecule
Emp. Form.:
C24H28F2O3S
Mol. Mass.:
434.539
SMILES:
CCc1cc(-c2ccsc2\C=C\C(\C)=C\C(O)=O)c(OCC(F)F)c(c1)C(C)(C)C
: