Target
Cannabinoid receptor 2
Ligand
BDBM60994
Substrate
Meas. Tech.
ChEBML_46989
Ki
25±n/a nM
Citation
 Krishnamurthy, MFerreira, AMMoore, BM Synthesis and testing of novel phenyl substituted side-chain analogues of classical cannabinoids. Bioorg Med Chem Lett 13:3487-90 (2003)  
Target
Name:
Cannabinoid receptor 2
Synonyms:
CANNABINOID CB2 CB2 CB2B CNR2_HUMAN Cannabinoid CB2 receptor Cannabinoid receptor 2 (CB2R) | hCB2
Type:
G Protein-Coupled Receptor (GPCR)
Mol. Mass.:
39690.94
Organism:
Homo sapiens (Human)
Description:
P34972
Residue:
360
  
Inhibitor
Name:
BDBM60994
Synonyms:
(10R,10aR)-6,6,9-Trimethyl-3-pentyl-6a,7,8,10a-tetrahydro-6H-benzo[c]chromen-1-ol 1N-[2-(5-dimethylaminomethyl-2-furylmethylsulfanyl)ethyl]-1N-methyl-2-nitro-(Z)-1-ethene-1,1-diamine 6,6,9-Trimethyl-3-pentyl-6a,7,8,10a-tetrahydro-6H-benzo[c]chromen-1-ol(DeltaE-9-THC) 8,8-Dimethyl-11-methylene-5-pentyl-3,4,8a,9,10,11,12,12a-octahydro-2H,8H-1,7-dioxa-benzo[c]phenanthrene BDBM50007391 DRONABINOL Tetrahydrocannabinol delta-9-THC delta-9-Tetrahydrocannabinol (THC) delta9-tetrahydrocannabinol
Type:
Emp. Form.:
C21H30O2
Mol. Mass.:
314.4617
SMILES:
CCCCCc1cc(O)c2[C@@H]3C=C(C)CC[C@H]3C(C)(C)Oc2c1
: