Target
Cruzipain
Ligand
BDBM50133616
Substrate
Meas. Tech.
ChEBML_210992
IC50
100000±n/a nM
Citation
 Chiyanzu, IHansell, EGut, JRosenthal, PJMcKerrow, JHChibale, K Synthesis and evaluation of isatins and thiosemicarbazone derivatives against cruzain, falcipain-2 and rhodesain. Bioorg Med Chem Lett 13:3527-30 (2003)  
Target
Name:
Cruzipain
Synonyms:
CYSP_TRYCR Cruzaine | Major cysteine proteinase
Type:
Protein
Mol. Mass.:
49831.41
Organism:
Trypanosoma cruzi
Description:
P25779
Residue:
467
  
Inhibitor
Name:
BDBM50133616
Synonyms:
1-Benzoyl-1H-indole-2,3-dione | CHEMBL118830
Type:
Small organic molecule
Emp. Form.:
C15H9NO3
Mol. Mass.:
251.2369
SMILES:
O=C(N1C(=O)C(=O)c2ccccc12)c1ccccc1
: