Target
Neuropeptide Y receptor type 5
Ligand
BDBM50133765
Substrate
Meas. Tech.
ChEBML_144129
Ki
27±n/a nM
Citation
 Elliott, RLOliver, RMLaFlamme, JAGillaspy, MLHammond, MHank, RFMaurer, TSBaker, DLDaSilva-Jardine, PAStevenson, RWMack, CMCassella, JV Structure-activity relationship studies on 2-heteroaryl-4-arylimidazoles NPY5 receptor antagonists. Bioorg Med Chem Lett 13:3593-6 (2003)  
Target
Name:
Neuropeptide Y receptor type 5
Synonyms:
NPY-Y5 NPY5-R NPY5R_HUMAN NPYY5 Neuropeptide Y receptor type 5 ( NPY Y5) | Y5 receptor
Type:
Enzyme
Mol. Mass.:
50746.64
Organism:
Homo sapiens (Human)
Description:
Q15761
Residue:
445
  
Inhibitor
Name:
BDBM50133765
Synonyms:
3-[5-(2-Trifluoromethyl-phenyl)-1H-imidazol-2-yl]-pyridine | CHEMBL120117
Type:
Small organic molecule
Emp. Form.:
C15H10F3N3
Mol. Mass.:
289.2552
SMILES:
FC(F)(F)c1ccccc1-c1c[nH]c(n1)-c1cccnc1
: