Target
Transient receptor potential cation channel subfamily V member 1
Ligand
BDBM50133821
Substrate
Meas. Tech.
ChEMBL_215813 (CHEMBL820102)
IC50
655±n/a nM
Citation
 Sun, QTafesse, LIslam, KZhou, XVictory, SFZhang, CHachicha, MSchmid, LAPatel, ARotshteyn, YValenzano, KJKyle, DJ 4-(2-pyridyl)piperazine-1-carboxamides: potent vanilloid receptor 1 antagonists. Bioorg Med Chem Lett 13:3611-6 (2003)  
Target
Name:
Transient receptor potential cation channel subfamily V member 1
Synonyms:
Capsaicin receptor TRPV1_RAT Trpv1 Vanilloid VR1 Vanilloid receptor 1 (VRI/TRPV1) Vanilloid receptor type 1-like (TrpV1/Vr1) Vr1l | osm-9-like TRP channel 1
Type:
Transient Receptor
Mol. Mass.:
94956.12
Organism:
Rattus norvegicus (rat)
Description:
O35433
Residue:
838
  
Inhibitor
Name:
BDBM50133821
Synonyms:
4-(3-Chloro-pyridin-2-yl)-piperazine-1-carboxylic acid (4-chloro-phenyl)-amide | CHEMBL122298
Type:
Small organic molecule
Emp. Form.:
C16H16Cl2N4O
Mol. Mass.:
351.23
SMILES:
Clc1ccc(NC(=O)N2CCN(CC2)c2ncccc2Cl)cc1
: